BDBM454174 US10716791, Code KP-313
SMILES O=C(NCc1ccccc1)[C@@H](CCn1ccnn1)NC(=O)c1ccco1
InChI Key InChIKey=TXMQCACEIZKFMD-OAHLLOKOSA-N
Data  3 KI
  Tab Delimited (TSV)   2D SDfile   Computed 3D by Vconf -m prep SDfile
Find this compound or compounds like it in BindingDB:
Activity Spreadsheet -- Enzyme Inhibition Constant Data from BindingDB
Found 3 hits for monomerid = 454174
TargetProtein-arginine deiminase type-2(Mus musculus)
University Health Network
US Patent
LigandPNGBDBM454174(US10716791, Code KP-313)
Affinity DataKi:  2.82E+5nM. Assay description: Materials: PAD1, PAD2, PAD3 and PAD4 were purchased from commercial sources. Assay buffer: 50 mM Tris pH 7.5, 100 mM NaCl, 10 mM CaCl2, 5 mM DTT. Col...
Ligand InfoPC cidPC sid
In DepthDetails US Patent
TargetProtein-arginine deiminase type-1(Homo sapiens (Human))
University Health Network
US Patent
LigandPNGBDBM454174(US10716791, Code KP-313)
Affinity DataKi:  1.09E+6nM. Assay description: Materials: PAD1, PAD2, PAD3 and PAD4 were purchased from commercial sources. Assay buffer: 50 mM Tris pH 7.5, 100 mM NaCl, 10 mM CaCl2, 5 mM DTT. Col...
Ligand InfoPC cidPC sid
In DepthDetails US Patent
TargetProtein-arginine deiminase type-4(Homo sapiens (Human))
University Health Network
US Patent
LigandPNGBDBM454174(US10716791, Code KP-313)
Affinity DataKi:  2.82E+6nM. Assay description: Materials: PAD1, PAD2, PAD3 and PAD4 were purchased from commercial sources. Assay buffer: 50 mM Tris pH 7.5, 100 mM NaCl, 10 mM CaCl2, 5 mM DTT. Col...
Ligand InfoPC cidPC sid
In DepthDetails US Patent