BDBM454175 US10716791, Code KP-314
SMILES Cn1cccc1C(=O)N[C@H](CCn1ccnn1)C(=O)NCc1ccccc1
InChI Key InChIKey=OCRQOIFWOQMOSR-MRXNPFEDSA-N
Data  3 KI
  Tab Delimited (TSV)   2D SDfile   Computed 3D by Vconf -m prep SDfile
Find this compound or compounds like it in BindingDB:
Activity Spreadsheet -- Enzyme Inhibition Constant Data from BindingDB
Found 3 hits for monomerid = 454175
TargetProtein-arginine deiminase type-4(Homo sapiens (Human))
University Health Network
US Patent
LigandPNGBDBM454175(US10716791, Code KP-314)
Affinity DataKi:  6.50E+4nM. Assay description: Materials: PAD1, PAD2, PAD3 and PAD4 were purchased from commercial sources. Assay buffer: 50 mM Tris pH 7.5, 100 mM NaCl, 10 mM CaCl2, 5 mM DTT. Col...
Ligand InfoPC cidPC sid
In DepthDetails US Patent
TargetProtein-arginine deiminase type-2(Mus musculus)
University Health Network
US Patent
LigandPNGBDBM454175(US10716791, Code KP-314)
Affinity DataKi:  7.10E+4nM. Assay description: Materials: PAD1, PAD2, PAD3 and PAD4 were purchased from commercial sources. Assay buffer: 50 mM Tris pH 7.5, 100 mM NaCl, 10 mM CaCl2, 5 mM DTT. Col...
Ligand InfoPC cidPC sid
In DepthDetails US Patent
TargetProtein-arginine deiminase type-1(Homo sapiens (Human))
University Health Network
US Patent
LigandPNGBDBM454175(US10716791, Code KP-314)
Affinity DataKi:  1.12E+5nM. Assay description: Materials: PAD1, PAD2, PAD3 and PAD4 were purchased from commercial sources. Assay buffer: 50 mM Tris pH 7.5, 100 mM NaCl, 10 mM CaCl2, 5 mM DTT. Col...
Ligand InfoPC cidPC sid
In DepthDetails US Patent