BDBM462162 US10766884, Example A78::US11220494, Example A78
SMILES Cc1nc2ccc(cc2n1C(C)(C)C)-c1nc(N[C@@H]2CCN(C[C@H]2O)S(C)(=O)=O)ncc1F
InChI Key InChIKey=XGPZVHJSIGQLBU-IEBWSBKVSA-N
Data  4 KI
  Tab Delimited (TSV)   2D SDfile   Computed 3D by Vconf -m prep SDfile
Find this compound or compounds like it in BindingDB:
Activity Spreadsheet -- Enzyme Inhibition Constant Data from BindingDB
Found 4 hits for monomerid = 462162
TargetCyclin-dependent kinase 4/G1/S-specific cyclin-D1(Homo sapiens (Human))
Pfizer
US Patent
LigandPNGBDBM462162(US10766884, Example A78 | US11220494, Example A78)
Affinity DataKi:  0.100nM. Assay description: CDK4/Cyclin D1: The purpose CDK4/Cyclin D1 assay is to evaluate the inhibition (% inhibition, Kiapp and Ki values) in the presence of small molecule ...
Ligand InfoPC cidPC sid
In DepthDetails US Patent
TargetCyclin-dependent kinase 4/G1/S-specific cyclin-D1(Homo sapiens (Human))
Pfizer
US Patent
LigandPNGBDBM462162(US10766884, Example A78 | US11220494, Example A78)
Affinity DataKi:  0.100nM. Assay description: The purpose CDK4/Cyclin D1 assay is to evaluate the inhibition (% inhibition, Kiapp and Ki values) in the presence of small molecule inhibitors by us...
Ligand InfoPC cidPC sid
In DepthDetails US Patent
TargetCyclin-dependent kinase 6/G1/S-specific cyclin-D3(Homo sapiens (Human))
Pfizer
US Patent
LigandPNGBDBM462162(US10766884, Example A78 | US11220494, Example A78)
Affinity DataKi:  1.80nM. Assay description: The purpose of the CDK6/Cyclin D3 assay is to evaluate the inhibition (% inhibition, Kiapp and Ki values) in the presence of small molecule inhibitor...
Ligand InfoPC cidPC sid
In DepthDetails US Patent
TargetCyclin-dependent kinase 6/G1/S-specific cyclin-D3(Homo sapiens (Human))
Pfizer
US Patent
LigandPNGBDBM462162(US10766884, Example A78 | US11220494, Example A78)
Affinity DataKi:  1.80nM. Assay description: CDK6/Cyclin D3: The purpose of the CDK6/Cyclin D3 assay is to evaluate the inhibition (% inhibition, Kiapp and Ki values) in the presence of small mo...
Ligand InfoPC cidPC sid
In DepthDetails US Patent