BDBM464407 US10793514, Compound 11
SMILES N[C@H](CCN(Cc1ccccc1Oc1ccccn1)Cc1ccccc1Oc1ccccn1)C(O)=O
InChI Key InChIKey=OGKRGHHJBKQKQZ-HSZRJFAPSA-N
Data  2 IC50
  Tab Delimited (TSV)   2D SDfile   Computed 3D by Vconf -m prep SDfile
Find this compound or compounds like it in BindingDB:
Activity Spreadsheet -- Enzyme Inhibition Constant Data from BindingDB
Found 2 hits for monomerid = 464407
TargetAmino acid transporter(Rattus norvegicus)
Vanderbilt University
US Patent
LigandPNGBDBM464407(US10793514, Compound 11)
Affinity DataIC50:  5.96E+4nM. Assay description: Live-cell amino acid uptake assays using HEK293 cells were carried out in 96-well plates (CulturPlate-96, Perkin Elmer). 96-well plates were coated w...
Ligand InfoPC cidPC sid
In DepthDetails US Patent
TargetNeutral amino acid transporter B(0)(Homo sapiens (Human))
Vanderbilt University
US Patent
LigandPNGBDBM464407(US10793514, Compound 11)
Affinity DataIC50:  6.82E+4nM. Assay description: Live-cell amino acid uptake assays using HEK293 cells were carried out in 96-well plates (CulturPlate-96, Perkin Elmer). 96-well plates were coated w...
Ligand InfoPC cidPC sid
In DepthDetails US Patent