BDBM479309 US10894794, Comp. Code No. GLP-130
SMILES C[C@H](NC(=O)c1cccc(Cl)c1)C(=O)N1CCn2c(C1)nnc2C(F)(F)F
InChI Key InChIKey=SQGATUYUKRHFHO-VIFPVBQESA-N
Data  1 IC50
  Tab Delimited (TSV)   2D SDfile   Computed 3D by Vconf -m prep SDfile
Find this compound or compounds like it in BindingDB:
Activity Spreadsheet -- Enzyme Inhibition Constant Data from BindingDB
Found 1 hit for monomerid = 479309
TargetDipeptidyl peptidase 4(Homo sapiens (Human))
King Abdulaziz University
US Patent
LigandPNGBDBM479309(US10894794, Comp. Code No. GLP-130)
Affinity DataIC50:  0.210nM. Assay description: itagliptin phosphate monohydrate and the different tested compounds were dissolved in dimethyl sulphoxide (DMSO) and diluted with tris buffer (pH 8.0...
Ligand InfoPC cidPC sid
In DepthDetails US Patent