BDBM48230 2-(4-methylphenyl)-5H-[1,2,4]triazolo[5,1-a]isoindole::2-(p-tolyl)-5H-[1,2,4]triazol[5,1-a]isoindole::MLS000548465::SMR000114054::cid_1040002
SMILES Cc1ccc(cc1)-c1nc2-c3ccccc3Cn2n1
InChI Key InChIKey=QBPTUGPJJOOHAY-UHFFFAOYSA-N
Data  3 EC50
  Tab Delimited (TSV)   2D SDfile   Computed 3D by Vconf -m prep SDfile
Find this compound or compounds like it in BindingDB:
Activity Spreadsheet -- Enzyme Inhibition Constant Data from BindingDB
Found 3 hits for monomerid = 48230
TargetMatrix metalloproteinase-14 [1-36](Homo sapiens (Human))
Sanford-Burnham Center For Chemical Genomics
Curated by PubChem BioAssay
LigandPNGBDBM48230(2-(4-methylphenyl)-5H-[1,2,4]triazolo[5,1-a]isoind...)
Affinity DataEC50:  1.49E+3nM. Assay description: Data Source: Sanford-Burnham Center for Chemical Genomics (SBCCG) Source Affiliation: Sanford-Burnham Medical Research Institute (SBMRI, San Diego, C...
In DepthDetails PCBioAssay
TargetOxysterols receptor LXR-beta(Homo sapiens (Human))
The Scripps Research Institute Molecular Screening Center
Curated by PubChem BioAssay
LigandPNGBDBM48230(2-(4-methylphenyl)-5H-[1,2,4]triazolo[5,1-a]isoind...)
Affinity DataEC50:  6.75E+4nM. Assay description: Source (MLPCN Center Name): The Scripps Research Institute Molecular Screening Center Affiliation: UT Southwestern Assay Provider: David Mangelsdorf,...
In DepthDetails PCBioAssay
TargetNuclear hormone receptor family member daf-12(Caenorhabditis elegans)
The Scripps Research Institute Molecular Screening Center
Curated by PubChem BioAssay
LigandPNGBDBM48230(2-(4-methylphenyl)-5H-[1,2,4]triazolo[5,1-a]isoind...)
Affinity DataEC50:  6.75E+4nM. Assay description: Source (MLPCN Center Name): The Scripps Research Institute Molecular Screening Center (SRIMSC) Affiliation: The Scripps Research Institute, TSRI Assa...
In DepthDetails PCBioAssay