BDBM488531 US10954253, Compound 38
SMILES COc1cc(Nc2ncc3c(n2)n(-c2cccc(n2)C(C)(C)O)n(CC=C)c3=O)ccc1N1CCC2(CCN(C)CC2)CC1
InChI Key InChIKey=LNXCHFHILOXOJM-UHFFFAOYSA-N
Data  1 IC50
  Tab Delimited (TSV)   2D SDfile   Computed 3D by Vconf -m prep SDfile
Find this compound or compounds like it in BindingDB:
Activity Spreadsheet -- Enzyme Inhibition Constant Data from BindingDB
Found 1 hit for monomerid = 488531
TargetWee1-like protein kinase(Homo sapiens (Human))
Shijiazhuang Sagacity New Drug Development
US Patent
LigandPNGBDBM488531(US10954253, Compound 38)
Affinity DataIC50:  20.7nM. Assay description: Experimental Reagents:Basic reaction buffer: 20 mM hydroxyethylpiperazine ethanesulfuric acid (pH 7.5), 10 mM magnesium chloride, 1 mM EGTA, 0.02% Br...
Ligand InfoPC cidPC sid
In DepthDetails US Patent