BDBM488566 US10954253, Compound 73
SMILES COC1(COC1)c1cccc(n1)-n1n(CC=C)c(=O)c2cnc(Nc3ccc(cc3)N3CCC4(CCN(C)CC4)CC3)nc12
InChI Key InChIKey=WMVAMKHRAFJTRF-UHFFFAOYSA-N
Data  1 IC50
  Tab Delimited (TSV)   2D SDfile   Computed 3D by Vconf -m prep SDfile
Find this compound or compounds like it in BindingDB:
Activity Spreadsheet -- Enzyme Inhibition Constant Data from BindingDB
Found 1 hit for monomerid = 488566
TargetWee1-like protein kinase(Homo sapiens (Human))
Shijiazhuang Sagacity New Drug Development
US Patent
LigandPNGBDBM488566(US10954253, Compound 73)
Affinity DataIC50:  5.30nM. Assay description: Experimental Reagents:Basic reaction buffer: 20 mM hydroxyethylpiperazine ethanesulfuric acid (pH 7.5), 10 mM magnesium chloride, 1 mM EGTA, 0.02% Br...
Ligand InfoPC cidPC sid
In DepthDetails US Patent