BDBM49177 2-pyridyl-[4-(2-thienyl)thiazol-2-yl]amine::MLS000030057::N-(2-pyridinyl)-4-thiophen-2-yl-2-thiazolamine::N-pyridin-2-yl-4-thiophen-2-yl-1,3-thiazol-2-amine::Pyridin-2-yl-(4-thiophen-2-yl-thiazol-2-yl)-amine::SMR000009411::cid_649291
SMILES N(c1nc(cs1)-c1cccs1)c1ccccn1
InChI Key InChIKey=FHPWUMPMAJGLKK-UHFFFAOYSA-N
Data  2 IC50  4 EC50
  Tab Delimited (TSV)   2D SDfile   Computed 3D by Vconf -m prep SDfile
Find this compound or compounds like it in BindingDB:
Activity Spreadsheet -- Enzyme Inhibition Constant Data from BindingDB
Found 6 hits for monomerid = 49177
TargetTranscription factor p65(Homo sapiens (Human))
Srmlsc
Curated by PubChem BioAssay
LigandPNGBDBM49177(2-pyridyl-[4-(2-thienyl)thiazol-2-yl]amine | MLS00...)
Affinity DataEC50:  667nM. Assay description: Southern Research Molecular Libraries Screening Center (SRMLSC) Southern Research Institute (Birmingham, Alabama) NIH Molecular Libraries Screening C...
In DepthDetails PCBioAssay
TargetVoltage-dependent T-type calcium channel subunit alpha-1H(Homo sapiens (Human))
Vanderbilt Screening Center For Gpcrs, Ion Channels and Transporters
Curated by PubChem BioAssay
LigandPNGBDBM49177(2-pyridyl-[4-(2-thienyl)thiazol-2-yl]amine | MLS00...)
Affinity DataEC50:  9.21E+3nM. Assay description: Assay Provider: Xinmin Xie Assay Provider Affiliation: Bioscience Division, SRI International, Menlo Park, CA Grant Title: HTS Assay for Cav3 T-Type ...
In DepthDetails PCBioAssay
TargetOxysterols receptor LXR-beta(Homo sapiens (Human))
The Scripps Research Institute Molecular Screening Center
Curated by PubChem BioAssay
LigandPNGBDBM49177(2-pyridyl-[4-(2-thienyl)thiazol-2-yl]amine | MLS00...)
Affinity DataEC50:  6.75E+4nM. Assay description: Source (MLPCN Center Name): The Scripps Research Institute Molecular Screening Center Affiliation: UT Southwestern Assay Provider: David Mangelsdorf,...
In DepthDetails PCBioAssay
TargetHeat shock protein hsp-16.2(Caenorhabditis elegans)
Burnham Center For Chemical Genomics
Curated by PubChem BioAssay
LigandPNGBDBM49177(2-pyridyl-[4-(2-thienyl)thiazol-2-yl]amine | MLS00...)
Affinity DataIC50: >6.40E+4nM
In DepthDetails PCBioAssay
TargetNuclear hormone receptor family member daf-12(Caenorhabditis elegans)
The Scripps Research Institute Molecular Screening Center
Curated by PubChem BioAssay
LigandPNGBDBM49177(2-pyridyl-[4-(2-thienyl)thiazol-2-yl]amine | MLS00...)
Affinity DataEC50:  6.75E+4nM. Assay description: Source (MLPCN Center Name): The Scripps Research Institute Molecular Screening Center (SRIMSC) Affiliation: The Scripps Research Institute, TSRI Assa...
In DepthDetails PCBioAssay
TargetProtein skinhead-1(Caenorhabditis elegans)
Burnham Center For Chemical Genomics
Curated by PubChem BioAssay
LigandPNGBDBM49177(2-pyridyl-[4-(2-thienyl)thiazol-2-yl]amine | MLS00...)
Affinity DataIC50:  2.17E+4nM
In DepthDetails PCBioAssay