BDBM49217 3-(1,3-benzodioxol-5-ylmethylideneamino)-N,4-dimethyl-1,3-thiazol-2-imine::3-(1,3-benzodioxol-5-ylmethylideneamino)-N,4-dimethyl-2-thiazolimine::MLS000096487::SMR000062295::cid_2385730::methyl-[4-methyl-3-(piperonylideneamino)-4-thiazolin-2-ylidene]amine
SMILES C\N=c1/scc(C)n1N=Cc1ccc2OCOc2c1
InChI Key InChIKey=YOZPQVTVHKUPCG-WDJVGNLWSA-N
Data  1 EC50
  Tab Delimited (TSV)   2D SDfile   Computed 3D by Vconf -m prep SDfile
Find this compound or compounds like it in BindingDB:
Activity Spreadsheet -- Enzyme Inhibition Constant Data from BindingDB
Found 1 hit for monomerid = 49217
TargetTranscription factor p65(Homo sapiens (Human))
Srmlsc
Curated by PubChem BioAssay
LigandPNGBDBM49217(3-(1,3-benzodioxol-5-ylmethylideneamino)-N,4-dimet...)
Affinity DataEC50:  129nM. Assay description: Southern Research Molecular Libraries Screening Center (SRMLSC) Southern Research Institute (Birmingham, Alabama) NIH Molecular Libraries Screening C...
In DepthDetails PCBioAssay