BDBM492458 6-(1-methylethyl)-5-(1- propyl-1H-pyrazol-4- yl)[1,2,4]triazolo[1,5- a]pyrimidin-7(4H)-one::US10975084, Example 11-21
SMILES CCCn1cc(cn1)-c1[nH]c2ncnn2c(=O)c1C(C)C
InChI Key InChIKey=FOFSSHAZVIKDBC-UHFFFAOYSA-N
Data  1 IC50
  Tab Delimited (TSV)   2D SDfile   Computed 3D by Vconf -m prep SDfile
Find this compound or compounds like it in BindingDB:
Activity Spreadsheet -- Enzyme Inhibition Constant Data from BindingDB
Found 1 hit for monomerid = 492458
TargetLysine-specific demethylase 5B(Homo sapiens (Human))
Merck Sharp & Dohme
US Patent
LigandPNGBDBM492458(6-(1-methylethyl)-5-(1- propyl-1H-pyrazol-4- yl)[1...)
Affinity DataIC50:  5.08nM. Assay description: In this assay, the potency (IC50) of each compound was determined from a ten point (1:3 serial dilution; final compound concentration range in assay ...
Ligand InfoPC cidPC sid
In DepthDetails US Patent