BDBM492477 6-(1-methylethyl)-5-[1- (pyridin-3-ylmethyl)-1H- pyrazol-4- yl][1,2,4]triazolo[1,5- a]pyrimidin-7(4H)-one::US10975084, Example 11-40
SMILES CC(C)c1c([nH]c2ncnn2c1=O)-c1cnn(Cc2cccnc2)c1
InChI Key InChIKey=GHDIGNOTZPSGGQ-UHFFFAOYSA-N
Data  1 IC50
  Tab Delimited (TSV)   2D SDfile   Computed 3D by Vconf -m prep SDfile
Find this compound or compounds like it in BindingDB:
Activity Spreadsheet -- Enzyme Inhibition Constant Data from BindingDB
Found 1 hit for monomerid = 492477
TargetLysine-specific demethylase 5B(Homo sapiens (Human))
Merck Sharp & Dohme
US Patent
LigandPNGBDBM492477(6-(1-methylethyl)-5-[1- (pyridin-3-ylmethyl)-1H- p...)
Affinity DataIC50:  5.77nM. Assay description: In this assay, the potency (IC50) of each compound was determined from a ten point (1:3 serial dilution; final compound concentration range in assay ...
Ligand InfoPC cidPC sid
In DepthDetails US Patent