BDBM49857 7-(2-oxidanylidenepropylsulfanyl)-2,3-dihydro-[1,4]dioxino[2,3-g]quinoline-8-carbonitrile::7-(2-oxopropylsulfanyl)-2,3-dihydro-[1,4]dioxino[2,3-g]quinoline-8-carbonitrile::7-(2-oxopropylthio)-2,3-dihydro-[1,4]dioxino[2,3-g]quinoline-8-carbonitrile::7-(acetonylthio)-2,3-dihydro-[1,4]dioxino[2,3-g]quinoline-8-carbonitrile::MLS000706370::SMR000288422::cid_1433869
SMILES CC(=O)CSc1nc2cc3OCCOc3cc2cc1C#N
InChI Key InChIKey=BBLMWNRDFUEGRR-UHFFFAOYSA-N
Data  3 EC50
  Tab Delimited (TSV)   2D SDfile   Computed 3D by Vconf -m prep SDfile
Find this compound or compounds like it in BindingDB:
Activity Spreadsheet -- Enzyme Inhibition Constant Data from BindingDB
Found 1 hit for monomerid = 49857
TargetEndoribonuclease toxin MazF(Escherichia coli str. K-12 substr. MG1655)
Burnham Center For Chemical Genomics
Curated by PubChem BioAssay
LigandPNGBDBM49857(7-(2-oxidanylidenepropylsulfanyl)-2,3-dihydro-[1,4...)
Affinity DataEC50: >9.90E+4nM. Assay description: Data Source: Sanford-Burnham Center for Chemical Genomics (SBCCG) Source Affiliation: Sanford-Burnham Medical Research Institute (SBMRI, San Diego, C...
In DepthDetails PCBioAssay