BDBM50000067 CHEMBL347514::[2-(3,4-Dichloro-phenyl)-ethyl]-methyl-(1-methyl-2-pyrrolidin-1-yl-ethyl)-amine
SMILES C[C@@H](CN1CCCC1)N(C)CCc1ccc(Cl)c(Cl)c1
InChI Key InChIKey=DBYCCKZCPWSDEM-ZDUSSCGKSA-N
Data  2 KI
  Tab Delimited (TSV)   2D SDfile   Computed 3D by Vconf -m prep SDfile
Find this compound or compounds like it in BindingDB:
Activity Spreadsheet -- Enzyme Inhibition Constant Data from BindingDB
Found 2 hits for monomerid = 50000067
TargetSigma non-opioid intracellular receptor 1(Homo sapiens (Human))
National Institute of Diabetes and Digestive and Kidney Diseases
Curated by ChEMBL
LigandPNGBDBM50000067(CHEMBL347514 | [2-(3,4-Dichloro-phenyl)-ethyl]-met...)
Affinity DataKi:  0.620nM. Assay description: Displacement of [3H]-(+) -3PPP from sigma receptor in guinea pig brain membranes
In DepthDetails ArticlePubMed
TargetD(2) dopamine receptor(Rattus norvegicus (rat))
National Institute of Diabetes and Digestive and Kidney Diseases
Curated by ChEMBL
LigandPNGBDBM50000067(CHEMBL347514 | [2-(3,4-Dichloro-phenyl)-ethyl]-met...)
Affinity DataKi:  1.12E+4nM. Assay description: Ability of the compound to displace [3H]-sulpiride from dopamine receptor D2 in rat brain
In DepthDetails ArticlePubMed