BDBM50000082 CHEMBL142353::Methyl-(2-naphthalen-2-yl-ethyl)-(2-pyrrolidin-1-yl-ethyl)-amine
SMILES CN(CCN1CCCC1)CCc1ccc2ccccc2c1
InChI Key InChIKey=ZGLVZILGSUJTIQ-UHFFFAOYSA-N
Data  1 KI
  Tab Delimited (TSV)   2D SDfile   Computed 3D by Vconf -m prep SDfile
Find this compound or compounds like it in BindingDB:
Activity Spreadsheet -- Enzyme Inhibition Constant Data from BindingDB
Found 1 hit for monomerid = 50000082
TargetSigma non-opioid intracellular receptor 1(Homo sapiens (Human))
National Institute of Diabetes and Digestive and Kidney Diseases
Curated by ChEMBL
LigandPNGBDBM50000082(CHEMBL142353 | Methyl-(2-naphthalen-2-yl-ethyl)-(2...)
Affinity DataKi:  2.10nM. Assay description: Displacement of [3H]-(+) -3PPP from sigma receptor in guinea pig brain membranes
In DepthDetails ArticlePubMed