BDBM50000083 CHEMBL142336::[2-(3,4-Dichloro-phenyl)-ethyl]-methyl-(3-pyrrolidin-1-yl-propyl)-amine
SMILES CN(CCCN1CCCC1)CCc1ccc(Cl)c(Cl)c1
InChI Key InChIKey=GRPPOEUSQHMZCG-UHFFFAOYSA-N
Data  1 KI
  Tab Delimited (TSV)   2D SDfile   Computed 3D by Vconf -m prep SDfile
Find this compound or compounds like it in BindingDB:
Activity Spreadsheet -- Enzyme Inhibition Constant Data from BindingDB
Found 1 hit for monomerid = 50000083
TargetSigma non-opioid intracellular receptor 1(Homo sapiens (Human))
National Institute of Diabetes and Digestive and Kidney Diseases
Curated by ChEMBL
LigandPNGBDBM50000083(CHEMBL142336 | [2-(3,4-Dichloro-phenyl)-ethyl]-met...)
Affinity DataKi:  1.80nM. Assay description: Displacement of [3H]-(+) -3PPP from sigma receptor in guinea pig brain membranes
In DepthDetails ArticlePubMed