BDBM50000525 2-Phenethyl-6-(3-phenoxy-propyl)-4-propyl-2,3-dihydro-benzofuran-5-ol::CHEMBL24964
SMILES CCCc1c2CC(CCc3ccccc3)Oc2cc(CCCOc2ccccc2)c1O
InChI Key InChIKey=QKEWWNWANRHBTQ-UHFFFAOYSA-N
Data  1 IC50
  Tab Delimited (TSV)   2D SDfile   Computed 3D by Vconf -m prep SDfile
Find this compound or compounds like it in BindingDB:
Activity Spreadsheet -- Enzyme Inhibition Constant Data from BindingDB
Found 1 hit for monomerid = 50000525
TargetPolyunsaturated fatty acid 5-lipoxygenase(Rattus norvegicus)
Merck Frosst Centre For Therapeutic Research
Curated by ChEMBL
LigandPNGBDBM50000525(2-Phenethyl-6-(3-phenoxy-propyl)-4-propyl-2,3-dihy...)
Affinity DataIC50:  127nM. Assay description: The compound was tested for its inhibitory activity against arachidonic acid in rat 5-lipoxygenase
In DepthDetails ArticlePubMed