BDBM50000526 2-Phenethyl-6-(3-phenoxy-propyl)-2,3-dihydro-benzofuran-5-ol::CHEMBL282530
SMILES Oc1cc2CC(CCc3ccccc3)Oc2cc1CCCOc1ccccc1
InChI Key InChIKey=WPWMIRXEAPDWIV-UHFFFAOYSA-N
Data  1 IC50
  Tab Delimited (TSV)   2D SDfile   Computed 3D by Vconf -m prep SDfile
Find this compound or compounds like it in BindingDB:
Activity Spreadsheet -- Enzyme Inhibition Constant Data from BindingDB
Found 1 hit for monomerid = 50000526
TargetPolyunsaturated fatty acid 5-lipoxygenase(Rattus norvegicus)
Merck Frosst Centre For Therapeutic Research
Curated by ChEMBL
LigandPNGBDBM50000526(2-Phenethyl-6-(3-phenoxy-propyl)-2,3-dihydro-benzo...)
Affinity DataIC50:  23nM. Assay description: Tested for its inhibitory activity against arachidonic acid in rat 5-lipoxygenase.
In DepthDetails ArticlePubMed