BDBM50000793 4-cyclopropylmethyl-14-(2-oxiranylmethoxy)-12-oxa-4-azapentacyclo[9.6.1.01,13.05,17.07,18]octadeca-7(18),8,10-triene-10,17-diol::CHEMBL311912
SMILES Oc1ccc2C[C@H]3N(CC4CC4)CC[C@@]45[C@@H](Oc1c24)[C@@H](CC[C@@]35O)OC[C@H]1CO1
InChI Key InChIKey=MRMVSXBCKQGIRC-LDYNJOKQSA-N
Data  4 IC50
  Tab Delimited (TSV)   2D SDfile   Computed 3D by Vconf -m prep SDfile
Find this compound or compounds like it in BindingDB:
Activity Spreadsheet -- Enzyme Inhibition Constant Data from BindingDB
Found 4 hits for monomerid = 50000793
TargetKappa-type opioid receptor(Cavia porcellus (domestic guinea pig))
University Of Washington
Curated by ChEMBL
LigandPNGBDBM50000793(4-cyclopropylmethyl-14-(2-oxiranylmethoxy)-12-oxa-...)
Affinity DataIC50:  17nM. Assay description: Displacement of 0.5 nM [3H]bremazocine from guinea pig brain membrane opioid receptor kappa with 100 nM DAGO and 100 nM DPDPE
In DepthDetails ArticlePubMed
TargetDelta-type/Kappa-type/Mu-type opioid receptor(Homo sapiens (Human))
University Of Washington
Curated by ChEMBL
LigandPNGBDBM50000793(4-cyclopropylmethyl-14-(2-oxiranylmethoxy)-12-oxa-...)
Affinity DataIC50:  11nM. Assay description: Inhibition of 0.5 nM [3H]bremazocine binding to guinea pig brain membrane opioid receptors
In DepthDetails ArticlePubMed
TargetMu-type opioid receptor(GUINEA PIG)
University Of Washington
Curated by ChEMBL
LigandPNGBDBM50000793(4-cyclopropylmethyl-14-(2-oxiranylmethoxy)-12-oxa-...)
Affinity DataIC50:  2.90nM. Assay description: inhibition of 1.0 nM [3H]- DAGO binding to guinea pig brain membrane opioid receptor mu
In DepthDetails ArticlePubMed
TargetDelta-type opioid receptor(Homo sapiens (Human))
University Of Washington
Curated by ChEMBL
LigandPNGBDBM50000793(4-cyclopropylmethyl-14-(2-oxiranylmethoxy)-12-oxa-...)
Affinity DataIC50:  12nM. Assay description: Inhibition of [3H]DPDPE binding to guinea pig brain membrane Opioid receptor delta 1 at 1.0 nM
In DepthDetails ArticlePubMed