BDBM50001019 6,11-Dimethyl-3-phenethyl-1,2,3,4,5,6-hexahydro-2,6-methano-benzo[d]azocin-8-ol::CHEMBL316632
SMILES C[C@H]1[C@H]2Cc3ccc(O)cc3[C@@]1(C)CCN2CCc1ccccc1
InChI Key InChIKey=ZQHYKVKNPWDQSL-USCONSEESA-N
Data  11 KI
  Tab Delimited (TSV)   2D SDfile   Computed 3D by Vconf -m prep SDfile
Find this compound or compounds like it in BindingDB:
Activity Spreadsheet -- Enzyme Inhibition Constant Data from BindingDB
Found 11 hits for monomerid = 50001019
TargetMu-type opioid receptor(Rattus norvegicus (rat))
Research Triangle Institute
Curated by ChEMBL
LigandPNGBDBM50001019(6,11-Dimethyl-3-phenethyl-1,2,3,4,5,6-hexahydro-2,...)
Affinity DataKi:  0.200nM. Assay description: Binding affinity against opioid receptor mu using [3H]-DAMGO as radioligand.
In DepthDetails ArticlePubMed
TargetMu-type opioid receptor(Homo sapiens (Human))TBA
LigandPNGBDBM50001019(6,11-Dimethyl-3-phenethyl-1,2,3,4,5,6-hexahydro-2,...)
Affinity DataKi:  0.200nM. Assay description: Binding affinity to mu opioid receptor (unknown origin) assessed as inhibition constant in presence of Levorphanol
In DepthDetails PubMed
TargetSigma non-opioid intracellular receptor 1(Cavia porcellus (Guinea pig))
Jiangsu Ocean University
Curated by ChEMBL
LigandPNGBDBM50001019(6,11-Dimethyl-3-phenethyl-1,2,3,4,5,6-hexahydro-2,...)
Affinity DataKi:  0.200nM. Assay description: Displacement of [3H](+)-pentazocine from sigma 1 receptor in guinea pig brain membranes by microbeta scintillation counting method
In DepthDetails PubMed
TargetSigma non-opioid intracellular receptor 1(Cavia porcellus (Guinea pig))
Jiangsu Ocean University
Curated by ChEMBL
LigandPNGBDBM50001019(6,11-Dimethyl-3-phenethyl-1,2,3,4,5,6-hexahydro-2,...)
Affinity DataKi:  0.200nM. Assay description: Displacement of [3H]-(+)-pentazocin from sigma1 receptor in guinea pig brain P2 membranes after 120 mins
In DepthDetails ArticlePubMed
TargetSigma non-opioid intracellular receptor 1(Cavia porcellus (Guinea pig))
Jiangsu Ocean University
Curated by ChEMBL
LigandPNGBDBM50001019(6,11-Dimethyl-3-phenethyl-1,2,3,4,5,6-hexahydro-2,...)
Affinity DataKi:  3.90nM. Assay description: Displacement of [3H]-(+)-pnetazocin from sigma1 receptor in guinea pig brain membrane incubated for 120 mins by scintillation counting method
In DepthDetails ArticlePubMed
TargetMu-type opioid receptor(GUINEA PIG)
Huazhong University Of Science And Technology
Curated by ChEMBL
LigandPNGBDBM50001019(6,11-Dimethyl-3-phenethyl-1,2,3,4,5,6-hexahydro-2,...)
Affinity DataKi:  55nM. Assay description: Displacement of [3H]DAMGO from mu opioid receptor in guinea pig brain membrane incubated for 2.5 hrs by scintillation counting method
In DepthDetails ArticlePubMed
TargetSigma non-opioid intracellular receptor 1(Cavia porcellus (Guinea pig))
Jiangsu Ocean University
Curated by ChEMBL
LigandPNGBDBM50001019(6,11-Dimethyl-3-phenethyl-1,2,3,4,5,6-hexahydro-2,...)
Affinity DataKi:  62nM. Assay description: Displacement of [3H]pentazocine from guinea pig brain membrane sigma 1 receptor incubated for 120 mins
In DepthDetails PubMed
TargetMu-type opioid receptor(Rattus norvegicus (rat))
Research Triangle Institute
Curated by ChEMBL
LigandPNGBDBM50001019(6,11-Dimethyl-3-phenethyl-1,2,3,4,5,6-hexahydro-2,...)
Affinity DataKi:  62nM. Assay description: Displacement of [3H] DAMGO from mu opioid receptor in Sprague-Dawley rat whole brain membranes after 2.5 hrs by liquid scintillation method
In DepthDetails ArticlePubMed
TargetMu-type opioid receptor(Homo sapiens (Human))TBA
LigandPNGBDBM50001019(6,11-Dimethyl-3-phenethyl-1,2,3,4,5,6-hexahydro-2,...)
Affinity DataKi:  62nM. Assay description: Displacement of [3H]-DAMGO from human MOR expressed in CHO-K1 cell membranes incubated for 90 mins measured by MicroBeta scintillation counter method
In DepthDetails PubMed
TargetSigma non-opioid intracellular receptor 1(Cavia porcellus (Guinea pig))
Jiangsu Ocean University
Curated by ChEMBL
LigandPNGBDBM50001019(6,11-Dimethyl-3-phenethyl-1,2,3,4,5,6-hexahydro-2,...)
Affinity DataKi:  80nM. Assay description: Displacement of [3H]-PTZ from sigma1 receptor in guinea pig brain membranes after 150 mins in presence of DPH solvent by liquid scintillation countin...
In DepthDetails ArticlePubMed
TargetSigma non-opioid intracellular receptor 1(Cavia porcellus (Guinea pig))
Jiangsu Ocean University
Curated by ChEMBL
LigandPNGBDBM50001019(6,11-Dimethyl-3-phenethyl-1,2,3,4,5,6-hexahydro-2,...)
Affinity DataKi:  85nM. Assay description: Displacement of [3H]-PTZ from sigma1 receptor in guinea pig brain membranes after 150 mins in presence of 1 mM DPH by liquid scintillation counting m...
In DepthDetails ArticlePubMed