BDBM50001063 CHEMBL3236022
SMILES Oc1ccc(cc1F)-n1ccc(c1)C(=O)C(F)F
InChI Key InChIKey=LNNULKVTZHKXCA-UHFFFAOYSA-N
Data  1 IC50
  Tab Delimited (TSV)   2D SDfile   Computed 3D by Vconf -m prep SDfile
Find this compound or compounds like it in BindingDB:
Activity Spreadsheet -- Enzyme Inhibition Constant Data from BindingDB
Found 1 hit for monomerid = 50001063
TargetAldo-keto reductase family 1 member B1(Rattus norvegicus)
Aristotle University Of Thessaloniki
Curated by ChEMBL
LigandPNGBDBM50001063(CHEMBL3236022)
Affinity DataIC50: >1.00E+5nM. Assay description: Inhibition of Fischer-344 rat kidney ALR1 using D-glucuronate as substrate by spectrophotometry
In DepthDetails ArticlePubMed