BDBM50001858 1-{5-[4-(2-Isopropyl-phenyl)-piperazin-1-ylmethyl]-1-methyl-1H-pyrrol-2-ylmethyl}-piperidin-2-one::CHEMBL155506
SMILES CC(C)c1ccccc1N1CCN(Cc2ccc(CN3CCCCC3=O)n2C)CC1
InChI Key InChIKey=HJPQWOMFLXBLKB-UHFFFAOYSA-N
Data  3 KI
  Tab Delimited (TSV)   2D SDfile   Computed 3D by Vconf -m prep SDfile
Find this compound or compounds like it in BindingDB:
Activity Spreadsheet -- Enzyme Inhibition Constant Data from BindingDB
Found 3 hits for monomerid = 50001858
TargetD(2) dopamine receptor(Rattus norvegicus (rat))
R. W. Johnson Pharmaceutical Research Institute
Curated by ChEMBL
LigandPNGBDBM50001858(1-{5-[4-(2-Isopropyl-phenyl)-piperazin-1-ylmethyl]...)
Affinity DataKi:  1.40nM. Assay description: Binding affinity towards dopamine receptor D2 by displacing [3H]spiperone radioligand in rat striatum
In DepthDetails ArticlePubMed
Target5-hydroxytryptamine receptor 1A/1B/1D/1F(RAT)
R. W. Johnson Pharmaceutical Research Institute
Curated by ChEMBL
LigandPNGBDBM50001858(1-{5-[4-(2-Isopropyl-phenyl)-piperazin-1-ylmethyl]...)
Affinity DataKi:  41nM. Assay description: The compound was tested for its binding affinity towards 5-hydroxytryptamine 1 receptor by displacing [3H]5-HT radioligand in rat cerebral cortex
In DepthDetails ArticlePubMed
TargetSerotonin 2 (5-HT2) receptor(RAT)
R. W. Johnson Pharmaceutical Research Institute
Curated by ChEMBL
LigandPNGBDBM50001858(1-{5-[4-(2-Isopropyl-phenyl)-piperazin-1-ylmethyl]...)
Affinity DataKi:  137nM. Assay description: The compound was tested for its binding affinity towards 5-hydroxytryptamine 2 receptor by displacing [3H]ketanserin radioligand in rat cerebral cort...
In DepthDetails ArticlePubMed