BDBM50002762 11-(2-Benzenesulfonylamino-ethylsulfanyl)-6,11-dihydro-dibenzo[b,e]oxepine-3-carboxylic acid::CHEMBL331356
SMILES OC(=O)c1ccc2C(SCCNS(=O)(=O)c3ccccc3)c3ccccc3COc2c1
InChI Key InChIKey=UCRKYRWLLIZCCF-UHFFFAOYSA-N
Data  2 IC50
  Tab Delimited (TSV)   2D SDfile   Computed 3D by Vconf -m prep SDfile
Find this compound or compounds like it in BindingDB:
Activity Spreadsheet -- Enzyme Inhibition Constant Data from BindingDB
Found 2 hits for monomerid = 50002762
TargetThromboxane-A synthase(Homo sapiens (Human))
Kyowa Hakko Kogyo
Curated by ChEMBL
LigandPNGBDBM50002762(11-(2-Benzenesulfonylamino-ethylsulfanyl)-6,11-dih...)
Affinity DataIC50:  370nM. Assay description: Compound was tested for its inhibitory activity against TXA2 synthase obtained from bovine platelet microsomes
In DepthDetails ArticlePubMed
TargetThromboxane-A synthase(Rattus norvegicus)
Kyowa Hakko Kogyo
Curated by ChEMBL
LigandPNGBDBM50002762(11-(2-Benzenesulfonylamino-ethylsulfanyl)-6,11-dih...)
Affinity DataIC50:  370nM. Assay description: Inhibitory effect of the compound against thromboxane A2 synthase binding to bovine platelets
In DepthDetails ArticlePubMed