BDBM50004352 CHEMBL14925::[(2R,5S)-5-(6-Amino-purin-9-yl)-tetrahydro-furan-2-yl]-methanol
SMILES Nc1ncnc2n(cnc12)[C@H]1CC[C@@H](CO)O1
InChI Key InChIKey=WVXRAFOPTSTNLL-NKWVEPMBSA-N
Data  1 KI
  Tab Delimited (TSV)   2D SDfile   Computed 3D by Vconf -m prep SDfile
Find this compound or compounds like it in BindingDB:
Activity Spreadsheet -- Enzyme Inhibition Constant Data from BindingDB
Found 1 hit for monomerid = 50004352
TargetAdenosine deaminase(Bos taurus (bovine))
University Of Montpellier
Curated by ChEMBL
LigandPNGBDBM50004352(CHEMBL14925 | [(2R,5S)-5-(6-Amino-purin-9-yl)-tetr...)
Affinity DataKi:  1.20E+5nM. Assay description: inhibitory activity against Adenosine deaminase
In DepthDetails ArticlePubMed