BDBM50005388 8-sec-Butyl-1,3-dipropyl-3,7-dihydro-purine-2,6-dione::CHEMBL347787
SMILES CCCn1c2nc([nH]c2c(=O)n(CCC)c1=O)C(C)CC
InChI Key InChIKey=YCCHHAFZTHOIHV-UHFFFAOYSA-N
Data  4 KI
  Tab Delimited (TSV)   2D SDfile   Computed 3D by Vconf -m prep SDfile
Find this compound or compounds like it in BindingDB:
Activity Spreadsheet -- Enzyme Inhibition Constant Data from BindingDB
Found 4 hits for monomerid = 50005388
TargetAdenosine receptor A1(GUINEA PIG)
Kyowa Hakko Kogyo
Curated by ChEMBL
LigandPNGBDBM50005388(8-sec-Butyl-1,3-dipropyl-3,7-dihydro-purine-2,6-di...)
Affinity DataKi:  25nM. Assay description: Binding affinity carried out with [3H]-cyclohexyladenosine in guinea pig forebrain membranes against adenosine A1 receptor
In DepthDetails ArticlePubMed
TargetAdenosine receptor A1(GUINEA PIG)
Kyowa Hakko Kogyo
Curated by ChEMBL
LigandPNGBDBM50005388(8-sec-Butyl-1,3-dipropyl-3,7-dihydro-purine-2,6-di...)
Affinity DataKi:  25nM. Assay description: Binding affinity against adenosine A1 receptor using N6-[3H]cyclohexyladenosine as radioligand in guinea pig forebrain membranes
In DepthDetails ArticlePubMed
TargetAdenosine receptor A2a/A2b(Rattus norvegicus)
Kyowa Hakko Kogyo
Curated by ChEMBL
LigandPNGBDBM50005388(8-sec-Butyl-1,3-dipropyl-3,7-dihydro-purine-2,6-di...)
Affinity DataKi:  1.20E+3nM. Assay description: Binding affinity against adenosine A2 receptor using N-[3H]-ethyladenosin-5''-uronamide as radioligand in rat striatal membranes.
In DepthDetails ArticlePubMed
TargetAdenosine receptor A2a/A2b(Rattus norvegicus)
Kyowa Hakko Kogyo
Curated by ChEMBL
LigandPNGBDBM50005388(8-sec-Butyl-1,3-dipropyl-3,7-dihydro-purine-2,6-di...)
Affinity DataKi:  1.20E+3nM. Assay description: Binding affinity carried out with [3H]5'-(N-ethylcarbamoyl)-adenosine in the presence of 50 nM cyclopentyladenosine in rat striatal membranes against...
In DepthDetails ArticlePubMed