BDBM50005561 3-Benzoyloxy-8-methyl-8-aza-bicyclo[3.2.1]octane-2-carboxylic acid benzyl ester::CHEMBL176723
SMILES CN1[C@@H]2CCC1C([C@H](C2)OC(=O)c1ccccc1)C(=O)OCc1ccccc1
InChI Key InChIKey=CODRVQGKDHKTDZ-OSIBBQKWSA-N
Data  1 IC50
  Tab Delimited (TSV)   2D SDfile   Computed 3D by Vconf -m prep SDfile
Find this compound or compounds like it in BindingDB:
Activity Spreadsheet -- Enzyme Inhibition Constant Data from BindingDB
Found 1 hit for monomerid = 50005561
TargetSodium-dependent dopamine transporter(Rattus norvegicus (rat))
Research Triangle Institute
Curated by ChEMBL
LigandPNGBDBM50005561(3-Benzoyloxy-8-methyl-8-aza-bicyclo[3.2.1]octane-2...)
Affinity DataIC50:  257nM. Assay description: Inhibition of [3H]WIN-35428 binding to the dopamine transporter
In DepthDetails ArticlePubMed