BDBM50005974 CHEMBL41330::Octadecanoic acid (2,4,6-trimethoxy-phenyl)-amide
SMILES CCCCCCCCCCCCCCCCCC(=O)Nc1c(OC)cc(OC)cc1OC
InChI Key InChIKey=AOOJWKDKXYWMGH-UHFFFAOYSA-N
Data  2 IC50
  Tab Delimited (TSV)   2D SDfile   Computed 3D by Vconf -m prep SDfile
Find this compound or compounds like it in BindingDB:
Activity Spreadsheet -- Enzyme Inhibition Constant Data from BindingDB
Found 2 hits for monomerid = 50005974
TargetAcyl-CoA:cholesterol acyltransferase(Oryctolagus cuniculus)
Warner-Lambert
Curated by ChEMBL
LigandPNGBDBM50005974(CHEMBL41330 | Octadecanoic acid (2,4,6-trimethoxy-...)
Affinity DataIC50:  52nM. Assay description: In vitro inhibition of acyl coenzyme A:cholesterol acyltransferase, in intestinal microsomes isolated from cholesterol-fed rabbits
In DepthDetails ArticlePubMed
TargetAcyl-CoA:cholesterol acyltransferase(Oryctolagus cuniculus)
Warner-Lambert
Curated by ChEMBL
LigandPNGBDBM50005974(CHEMBL41330 | Octadecanoic acid (2,4,6-trimethoxy-...)
Affinity DataIC50:  52nM. Assay description: Acyl coenzyme A:cholesterol acyltransferase (ACAT), inhibition by incubation with [1-14C]oleolyl-CoA and intestinal microsomes isolated from intestin...
In DepthDetails ArticlePubMed