BDBM50007849 8-(3-Amino-cyclohexyl)-1,3-dipropyl-3,7-dihydro-purine-2,6-dione (CF3CO2H.1/2H2O)::CHEMBL56673
SMILES CCCn1c2nc([nH]c2c(=O)n(CCC)c1=O)C1CCCC(N)C1
InChI Key InChIKey=UJIBBITWRBXXCH-UHFFFAOYSA-N
Data  2 KI
  Tab Delimited (TSV)   2D SDfile   Computed 3D by Vconf -m prep SDfile
Find this compound or compounds like it in BindingDB:
Activity Spreadsheet -- Enzyme Inhibition Constant Data from BindingDB
Found 2 hits for monomerid = 50007849
TargetAdenosine receptor A1(Homo sapiens (Human))
Vanderbilt University
Curated by ChEMBL
LigandPNGBDBM50007849(8-(3-Amino-cyclohexyl)-1,3-dipropyl-3,7-dihydro-pu...)
Affinity DataKi:  50nM. Assay description: Antagonist activity against adenosine A1 receptor in human platelets
In DepthDetails ArticlePubMed
TargetAdenosine receptor A2a/A2b(Rattus norvegicus)
Vanderbilt University
Curated by ChEMBL
LigandPNGBDBM50007849(8-(3-Amino-cyclohexyl)-1,3-dipropyl-3,7-dihydro-pu...)
Affinity DataKi: >1.00E+4nM. Assay description: Antagonistic activity against adenosine A2 receptor in rat adipocytes
In DepthDetails ArticlePubMed