BDBM50008593 CHEMBL346060::Sodium; 1-(2-mercaptomethyl-3-phenyl-propionylamino)-3-methyl-butane-1-sulfonate (0.75H2O)
SMILES CC(C)CC(NC(=O)C(CS)Cc1ccccc1)S([O-])(=O)=O
InChI Key InChIKey=IFOJNPIPERNZBH-UHFFFAOYSA-M
Data  1 IC50
  Tab Delimited (TSV)   2D SDfile   Computed 3D by Vconf -m prep SDfile
Find this compound or compounds like it in BindingDB:
Activity Spreadsheet -- Enzyme Inhibition Constant Data from BindingDB
Found 1 hit for monomerid = 50008593
TargetNeprilysin(Rattus norvegicus (Rat))
Dainippon Pharmaceutical
Curated by ChEMBL
LigandPNGBDBM50008593(CHEMBL346060 | Sodium; 1-(2-mercaptomethyl-3-pheny...)
Affinity DataIC50:  250nM. Assay description: In vitro inhibitory activity against enkephalinase enzyme from rat.
In DepthDetails ArticlePubMed