BDBM50008601 CHEMBL155288::Sodium; 2-[cyclopropyl-(2-mercaptomethyl-3-phenyl-propionyl)-amino]-ethanesulfonate (0.25H2O)
SMILES [O-]S(=O)(=O)CCN(C1CC1)C(=O)C(CS)Cc1ccccc1
InChI Key InChIKey=OFGSQFGXBRATEZ-UHFFFAOYSA-M
Data  1 IC50
  Tab Delimited (TSV)   2D SDfile   Computed 3D by Vconf -m prep SDfile
Find this compound or compounds like it in BindingDB:
Activity Spreadsheet -- Enzyme Inhibition Constant Data from BindingDB
Found 1 hit for monomerid = 50008601
TargetNeprilysin(Rattus norvegicus (Rat))
Dainippon Pharmaceutical
Curated by ChEMBL
LigandPNGBDBM50008601(CHEMBL155288 | Sodium; 2-[cyclopropyl-(2-mercaptom...)
Affinity DataIC50:  4.20E+3nM. Assay description: In vitro inhibitory activity against enkephalinase enzyme from rat.
In DepthDetails ArticlePubMed