BDBM50008604 CHEMBL155070::Sodium; 4-(2-mercaptomethyl-3-naphthalen-1-yl-propionylamino)-benzenesulfonate (2.25H2O)
SMILES [O-]S(=O)(=O)c1ccc(NC(=O)C(CS)Cc2cccc3ccccc23)cc1
InChI Key InChIKey=LIVQWWDDXDIIJD-UHFFFAOYSA-M
Data  1 IC50
  Tab Delimited (TSV)   2D SDfile   Computed 3D by Vconf -m prep SDfile
Find this compound or compounds like it in BindingDB:
Activity Spreadsheet -- Enzyme Inhibition Constant Data from BindingDB
Found 1 hit for monomerid = 50008604
TargetNeprilysin(Rattus norvegicus (Rat))
Dainippon Pharmaceutical
Curated by ChEMBL
LigandPNGBDBM50008604(CHEMBL155070 | Sodium; 4-(2-mercaptomethyl-3-napht...)
Affinity DataIC50:  34nM. Assay description: In vitro inhibitory activity against enkephalinase enzyme from rat.
In DepthDetails ArticlePubMed