BDBM50008609 CHEMBL347390::Sodium; 2-[2-mercaptomethyl-3-(4-methoxy-phenyl)-propionylamino]-ethanesulfonate (0.5H2O)
SMILES COc1ccc(CC(CS)C(=O)NCCS([O-])(=O)=O)cc1
InChI Key InChIKey=BQDBTBNQEWZGJL-UHFFFAOYSA-M
Data  1 IC50
  Tab Delimited (TSV)   2D SDfile   Computed 3D by Vconf -m prep SDfile
Find this compound or compounds like it in BindingDB:
Activity Spreadsheet -- Enzyme Inhibition Constant Data from BindingDB
Found 1 hit for monomerid = 50008609
TargetNeprilysin(Rattus norvegicus (Rat))
Dainippon Pharmaceutical
Curated by ChEMBL
LigandPNGBDBM50008609(CHEMBL347390 | Sodium; 2-[2-mercaptomethyl-3-(4-me...)
Affinity DataIC50:  4.40nM. Assay description: In vitro inhibitory activity against enkephalinase enzyme from rat.
In DepthDetails ArticlePubMed