BDBM50008614 4-(2-Mercaptomethyl-3-pyridin-3-yl-propionylamino)-benzenesulfonic acid (0.5H2O)::CHEMBL157694
SMILES OS(=O)(=O)c1ccc(NC(=O)C(CS)Cc2cccnc2)cc1
InChI Key InChIKey=UJAQWYXVAACBLX-UHFFFAOYSA-N
Data  1 IC50
  Tab Delimited (TSV)   2D SDfile   Computed 3D by Vconf -m prep SDfile
Find this compound or compounds like it in BindingDB:
Activity Spreadsheet -- Enzyme Inhibition Constant Data from BindingDB
Found 1 hit for monomerid = 50008614
TargetNeprilysin(Rattus norvegicus (Rat))
Dainippon Pharmaceutical
Curated by ChEMBL
LigandPNGBDBM50008614(4-(2-Mercaptomethyl-3-pyridin-3-yl-propionylamino)...)
Affinity DataIC50:  33nM. Assay description: In vitro inhibitory activity against enkephalinase enzyme from rat.
In DepthDetails ArticlePubMed