BDBM50008886 CHEMBL3237331
SMILES Clc1cccc(c1)C(c1c[nH]c2ccc(Br)cc12)c1c[nH]c2ccc(Br)cc12
InChI Key InChIKey=KQDUSQCYKUCYMT-UHFFFAOYSA-N
Data  1 IC50
  Tab Delimited (TSV)   2D SDfile   Computed 3D by Vconf -m prep SDfile
Find this compound or compounds like it in BindingDB:
Activity Spreadsheet -- Enzyme Inhibition Constant Data from BindingDB
Found 1 hit for monomerid = 50008886
TargetBeta-glucuronidase(Bos taurus (Bovine))
University Of Karachi
Curated by ChEMBL
LigandPNGBDBM50008886(CHEMBL3237331)
Affinity DataIC50:  2.23E+4nM. Assay description: Inhibition of bovine liver beta-glucuronidase using p-nitrophenyl-beta-D-glucuronide as substrate after 30 mins by spectrophotometry
In DepthDetails ArticlePubMed