BDBM50010235 CHEMBL3245590
SMILES COC(=O)CCC1NC(=O)N(C1=O)c1ccc(cc1)N(C)Cc1cnc2nc(N)nc(N)c2n1
InChI Key InChIKey=AQLKDVVRYXBITI-UHFFFAOYSA-N
Data  1 IC50
  Tab Delimited (TSV)   2D SDfile   Computed 3D by Vconf -m prep SDfile
Find this compound or compounds like it in BindingDB:
Activity Spreadsheet -- Enzyme Inhibition Constant Data from BindingDB
Found 1 hit for monomerid = 50010235
TargetDihydrofolate reductase(Lactobacillus casei)
TBA
Curated by ChEMBL
LigandPNGBDBM50010235(CHEMBL3245590)
Affinity DataIC50:  4.00E+3nM. Assay description: Inhibition of Lactobacillus casei ATCC 7469 dihydrofolate reductase
In DepthDetails ArticlePubMed