BDBM50010332 CHEMBL3251376
SMILES [H][C@@]12C=CN(C=C1C(=O)NC(O)C2CCCCCCCC)[C@@H]1O[C@H](COP(O)(=O)O[C@@H]2[C@@H](COP(O)(=O)OP(O)(O)=O)O[C@H]([C@@H]2O)n2cnc3c(N)ncnc23)[C@@H](O)[C@H]1O
InChI Key InChIKey=WOLJRDKBBGJKFR-MKXXBDDJSA-N
Data  1 KI
  Tab Delimited (TSV)   2D SDfile   Computed 3D by Vconf -m prep SDfile
Find this compound or compounds like it in BindingDB:
Activity Spreadsheet -- Enzyme Inhibition Constant Data from BindingDB
Found 1 hit for monomerid = 50010332
TargetAldo-keto reductase family 1 member B1 [K65Q](Bos taurus (Cattle))
TBA
Curated by ChEMBL
LigandPNGBDBM50010332(CHEMBL3251376)
Affinity DataKi:  2.30E+3nM. Assay description: Inhibition of beef brain NADP-dependent aldehyde reductase using p-nitrobenzaldehyde by competitive inhibition assay
In DepthDetails ArticlePubMed