BDBM50011978 3-[2-Butyl-3-(4-hydroxy-3-methyl-benzyl)-3H-imidazol-4-yl]-2-thiophen-2-ylmethyl-acrylic acid::CHEMBL40089
SMILES CCCCc1ncc(\C=C(/Cc2cccs2)C(O)=O)n1Cc1ccc(O)c(C)c1
InChI Key InChIKey=PJZRXHQEYPAKJT-LDADJPATSA-N
Data  2 IC50
  Tab Delimited (TSV)   2D SDfile   Computed 3D by Vconf -m prep SDfile
Find this compound or compounds like it in BindingDB:
Activity Spreadsheet -- Enzyme Inhibition Constant Data from BindingDB
Found 2 hits for monomerid = 50011978
LigandPNGBDBM50011978(3-[2-Butyl-3-(4-hydroxy-3-methyl-benzyl)-3H-imidaz...)
Affinity DataIC50:  21nM. Assay description: Inhibition of [125I]AII binding to Angiotensin II receptor, type 1 of rat mesenteric arteries
In DepthDetails ArticlePubMed
TargetType-2 angiotensin II receptor(RAT)
Smithkline Beecham Pharmaceuticals
Curated by ChEMBL
LigandPNGBDBM50011978(3-[2-Butyl-3-(4-hydroxy-3-methyl-benzyl)-3H-imidaz...)
Affinity DataIC50:  21nM. Assay description: In vitro inhibition of [125I]-AII specific binding towards Angiotensin II receptor in rat mesenteric membranes.
In DepthDetails ArticlePubMed