BDBM50014267 7-Phenyl-7H-pyrrolo[2,3-d]pyrimidin-4-ylamine::CHEMBL95105
SMILES Nc1ncnc2n(ccc12)-c1ccccc1
InChI Key InChIKey=HSKDJAAEBMULSP-UHFFFAOYSA-N
Data  2 KI
  Tab Delimited (TSV)   2D SDfile   Computed 3D by Vconf -m prep SDfile
Find this compound or compounds like it in BindingDB:
Activity Spreadsheet -- Enzyme Inhibition Constant Data from BindingDB
Found 2 hits for monomerid = 50014267
TargetAdenosine receptor A1(Rattus norvegicus (rat))
National Institute Of Diabetes
Curated by ChEMBL
LigandPNGBDBM50014267(7-Phenyl-7H-pyrrolo[2,3-d]pyrimidin-4-ylamine | CH...)
Affinity DataKi:  3.10E+3nM. Assay description: Binding affinity against Adenosine A1 receptor from rat brain membrane using [3H]-R-PIA as radioligand
In DepthDetails ArticlePubMed
TargetAdenosine receptor A2a/A2b(Rattus norvegicus)
National Institute Of Diabetes
Curated by ChEMBL
LigandPNGBDBM50014267(7-Phenyl-7H-pyrrolo[2,3-d]pyrimidin-4-ylamine | CH...)
Affinity DataKi:  2.50E+4nM. Assay description: Binding affinity against Adenosine A2 receptor from rat striatal membrane using [3H]NECA as radioligand
In DepthDetails ArticlePubMed