BDBM50014293 7-(2,3-Dimethoxy-phenyl)-5,6-dimethyl-7H-pyrrolo[2,3-d]pyrimidin-4-ylamine::CHEMBL97770
SMILES COc1cccc(c1OC)-n1c(C)c(C)c2c(N)ncnc12
InChI Key InChIKey=RRZLVVDBXSMRRG-UHFFFAOYSA-N
Data  1 KI
  Tab Delimited (TSV)   2D SDfile   Computed 3D by Vconf -m prep SDfile
Find this compound or compounds like it in BindingDB:
Activity Spreadsheet -- Enzyme Inhibition Constant Data from BindingDB
Found 1 hit for monomerid = 50014293
TargetAdenosine receptor A1(Rattus norvegicus (rat))
National Institute Of Diabetes
Curated by ChEMBL
LigandPNGBDBM50014293(7-(2,3-Dimethoxy-phenyl)-5,6-dimethyl-7H-pyrrolo[2...)
Affinity DataKi:  5.43E+4nM. Assay description: Binding affinity against Adenosine A1 receptor from rat brain membrane using [3H]-R-PIA as radioligand
In DepthDetails ArticlePubMed