BDBM50014847 CHEMBL152800::Carbonic acid butyl ester 7-formylamino-1,2-dimethoxy-10-methylsulfanyl-9-oxo-5,6,7,9-tetrahydro-benzo[a]heptalen-3-yl ester
SMILES CCCCOC(=O)Oc1cc2CC[C@H](NC=O)c3cc(=O)c(SC)ccc3-c2c(OC)c1OC
InChI Key InChIKey=FHROLVKJTGAQLL-SFHVURJKSA-N
Data  1 IC50
  Tab Delimited (TSV)   2D SDfile   Computed 3D by Vconf -m prep SDfile
Find this compound or compounds like it in BindingDB:
Activity Spreadsheet -- Enzyme Inhibition Constant Data from BindingDB
Found 1 hit for monomerid = 50014847
TargetTubulin beta-2B chain(Bos taurus)
Niddk
Curated by ChEMBL
LigandPNGBDBM50014847(CHEMBL152800 | Carbonic acid butyl ester 7-formyla...)
Affinity DataIC50:  2.10E+3nM. Assay description: Inhibitory effect on the polymerization of purified bovine brain tubulin.
In DepthDetails ArticlePubMed