BDBM50014855 1,2,3-Trimethoxy-7-methylamino-10-methylsulfanyl-6,7-dihydro-5H-benzo[a]heptalen-9-one::1,2,3-Trimethoxy-7-methylamino-10-methylsulfanyl-6,7-dihydro-5H-benzo[a]heptalen-9-one (Thiodemecolcine)::CHEMBL19531
SMILES CN[C@H]1CCc2cc(OC)c(OC)c(OC)c2-c2ccc(SC)c(=O)cc12
InChI Key InChIKey=RRCKMQLZGKWNPR-HNNXBMFYSA-N
Data  1 IC50
  Tab Delimited (TSV)   2D SDfile   Computed 3D by Vconf -m prep SDfile
Find this compound or compounds like it in BindingDB:
Activity Spreadsheet -- Enzyme Inhibition Constant Data from BindingDB
Found 1 hit for monomerid = 50014855
TargetTubulin beta-2B chain(Bos taurus)
Niddk
Curated by ChEMBL
LigandPNGBDBM50014855(1,2,3-Trimethoxy-7-methylamino-10-methylsulfanyl-6...)
Affinity DataIC50:  1.30E+3nM. Assay description: Inhibitory effect on the polymerization of purified bovine brain tubulin.
In DepthDetails ArticlePubMed