BDBM50014859 CHEMBL438563::Methyl-(1,2,3,10-tetramethoxy-9-oxo-5,6,7,9-tetrahydro-benzo[a]heptalen-7-yl)-carbamic acid butyl ester
SMILES CCCCOC(=O)N(C)[C@H]1CCc2cc(OC)c(OC)c(OC)c2-c2ccc(OC)c(=O)cc12
InChI Key InChIKey=VNOPMQKFGPXEJG-IBGZPJMESA-N
Data  1 IC50
  Tab Delimited (TSV)   2D SDfile   Computed 3D by Vconf -m prep SDfile
Find this compound or compounds like it in BindingDB:
Activity Spreadsheet -- Enzyme Inhibition Constant Data from BindingDB
Found 1 hit for monomerid = 50014859
TargetTubulin beta-2B chain(Bos taurus)
Niddk
Curated by ChEMBL
LigandPNGBDBM50014859(CHEMBL438563 | Methyl-(1,2,3,10-tetramethoxy-9-oxo...)
Affinity DataIC50:  2.00E+3nM. Assay description: Inhibitory effect on the polymerization of purified bovine brain tubulin.
In DepthDetails ArticlePubMed