BDBM50014864 CHEMBL356376::N-(1,2,3-Trimethoxy-10-methylsulfanyl-9-thioxo-5,6,7,9-tetrahydro-benzo[a]heptalen-7-yl)-acetamide
SMILES COc1cc2CC[C@H](NC(C)=O)c3cc(=S)c(SC)ccc3-c2c(OC)c1OC
InChI Key InChIKey=OZGKDUJVKQSGJQ-INIZCTEOSA-N
Data  1 IC50
  Tab Delimited (TSV)   2D SDfile   Computed 3D by Vconf -m prep SDfile
Find this compound or compounds like it in BindingDB:
Activity Spreadsheet -- Enzyme Inhibition Constant Data from BindingDB
Found 1 hit for monomerid = 50014864
TargetTubulin beta-2B chain(Bos taurus)
Niddk
Curated by ChEMBL
LigandPNGBDBM50014864(CHEMBL356376 | N-(1,2,3-Trimethoxy-10-methylsulfan...)
Affinity DataIC50:  1.60E+3nM. Assay description: Inhibitory effect on the polymerization of purified bovine brain tubulin.
In DepthDetails ArticlePubMed