BDBM50014869 CHEMBL154225::N-(3-Hydroxy-1,2-dimethoxy-10-methylsulfanyl-9-oxo-5,6,7,9-tetrahydro-benzo[a]heptalen-7-yl)-butyramide
SMILES CCCC(=O)N[C@H]1CCc2cc(O)c(OC)c(OC)c2-c2ccc(SC)c(=O)cc12
InChI Key InChIKey=WBIROJVEMHKQCB-INIZCTEOSA-N
Data  1 IC50
  Tab Delimited (TSV)   2D SDfile   Computed 3D by Vconf -m prep SDfile
Find this compound or compounds like it in BindingDB:
Activity Spreadsheet -- Enzyme Inhibition Constant Data from BindingDB
Found 1 hit for monomerid = 50014869
TargetTubulin beta-2B chain(Bos taurus)
Niddk
Curated by ChEMBL
LigandPNGBDBM50014869(CHEMBL154225 | N-(3-Hydroxy-1,2-dimethoxy-10-methy...)
Affinity DataIC50:  1.70E+3nM. Assay description: Inhibitory effect on the polymerization of purified bovine brain tubulin.
In DepthDetails ArticlePubMed