BDBM50016839 5-Methyl-6-[4-(4,5,6,7-tetrahydro-benzoimidazol-1-yl)-phenyl]-4,5-dihydro-2H-pyridazin-3-one::CHEMBL282765
SMILES CC1CC(=O)NN=C1c1ccc(cc1)-n1cnc2CCCCc12
InChI Key InChIKey=KDEKNYKHIZTSLE-UHFFFAOYSA-N
Data  7 IC50
  Tab Delimited (TSV)   2D SDfile   Computed 3D by Vconf -m prep SDfile
Find this compound or compounds like it in BindingDB:
Activity Spreadsheet -- Enzyme Inhibition Constant Data from BindingDB
Found 7 hits for monomerid = 50016839
TargetcGMP-dependent 3',5'-cyclic phosphodiesterase(Homo sapiens (Human))
Warner-Lambert
Curated by ChEMBL
LigandPNGBDBM50016839(5-Methyl-6-[4-(4,5,6,7-tetrahydro-benzoimidazol-1-...)
Affinity DataIC50:  4.30E+4nM. Assay description: Inhibitory concentration against cGMP PDE II enzyme in guinea pig
In DepthDetails ArticlePubMed
LigandPNGBDBM50016839(5-Methyl-6-[4-(4,5,6,7-tetrahydro-benzoimidazol-1-...)
Affinity DataIC50:  7.50E+4nM. Assay description: Inhibitory concentration against cAMP PDE I enzyme in guinea pig
In DepthDetails ArticlePubMed
LigandPNGBDBM50016839(5-Methyl-6-[4-(4,5,6,7-tetrahydro-benzoimidazol-1-...)
Affinity DataIC50:  8.50E+4nM. Assay description: Inhibitory concentration against cGMP PDE I enzyme in guinea pig
In DepthDetails ArticlePubMed
TargetcGMP-inhibited 3',5'-cyclic phosphodiesterase 3A/3B(Homo sapiens (Human))
Vrije Universiteit
Curated by ChEMBL
LigandPNGBDBM50016839(5-Methyl-6-[4-(4,5,6,7-tetrahydro-benzoimidazol-1-...)
Affinity DataIC50:  501nM. Assay description: Inhibition of dual cGMP-inhibited phosphodiesterase 3 (PDE3) was determined in homogenates from human platelets.
In DepthDetails ArticlePubMed
TargetcGMP-inhibited 3',5'-cyclic phosphodiesterase 3A/3B(Homo sapiens (Human))
Vrije Universiteit
Curated by ChEMBL
LigandPNGBDBM50016839(5-Methyl-6-[4-(4,5,6,7-tetrahydro-benzoimidazol-1-...)
Affinity DataIC50:  150nM. Assay description: Inhibitory concentration against cAMP PDE III enzyme in guinea pig
In DepthDetails ArticlePubMed
TargetcGMP-inhibited 3',5'-cyclic phosphodiesterase 3A/3B(Homo sapiens (Human))
Vrije Universiteit
Curated by ChEMBL
LigandPNGBDBM50016839(5-Methyl-6-[4-(4,5,6,7-tetrahydro-benzoimidazol-1-...)
Affinity DataIC50:  110nM. Assay description: Inhibition of phosphodiesterase 3 from human platelets at 1E-7-1E-4M or 1.0E-6 to 1E-3 M
In DepthDetails ArticlePubMed
TargetcGMP-dependent 3',5'-cyclic phosphodiesterase(Homo sapiens (Human))
Warner-Lambert
Curated by ChEMBL
LigandPNGBDBM50016839(5-Methyl-6-[4-(4,5,6,7-tetrahydro-benzoimidazol-1-...)
Affinity DataIC50:  4.60E+4nM. Assay description: Inhibitory concentration against cAMP PDE II enzyme in guinea pig
In DepthDetails ArticlePubMed