BDBM50017218 2-sec-Butyl-4-[4-(4-{4-[2-(2,4-dichloro-phenyl)-2-imidazol-1-ylmethyl-[1,3]dioxolan-4-ylmethoxy]-phenyl}-piperazin-1-yl)-phenyl]-2,4-dihydro-[1,2,4]triazol-3-one::CHEMBL430787
SMILES CCC(C)n1ncn(-c2ccc(cc2)N2CCN(CC2)c2ccc(OC[C@H]3CO[C@@](Cn4ccnc4)(O3)c3ccc(Cl)cc3Cl)cc2)c1=O
InChI Key InChIKey=VMUOFFFWZGGOFF-OPBYRSFKSA-N
Data  1 IC50
  Tab Delimited (TSV)   2D SDfile   Computed 3D by Vconf -m prep SDfile
Find this compound or compounds like it in BindingDB:
Activity Spreadsheet -- Enzyme Inhibition Constant Data from BindingDB
Found 1 hit for monomerid = 50017218
TargetGonadotropin-releasing hormone receptor(Rattus norvegicus)
Abbott Laboratories
Curated by ChEMBL
LigandPNGBDBM50017218(2-sec-Butyl-4-[4-(4-{4-[2-(2,4-dichloro-phenyl)-2-...)
Affinity DataIC50: >3.00E+4nM. Assay description: Binding affinity at Leutinizing releasing hormone receptor in rat pituitary using [125I]-leuprolide as radioligand
In DepthDetails ArticlePubMed