BDBM50018528 CHEMBL3290664
SMILES C[C@H]1C[C@H]([C@H](O)[C@@H]1O)n1cnc2c(N)ncc(F)c12
InChI Key InChIKey=SSZMRTAPOVWYHW-LKYMCVAFSA-N
Data  1 IC50
  Tab Delimited (TSV)   2D SDfile   Computed 3D by Vconf -m prep SDfile
Find this compound or compounds like it in BindingDB:
Activity Spreadsheet -- Enzyme Inhibition Constant Data from BindingDB
Found 1 hit for monomerid = 50018528
TargetAdenosylhomocysteinase(Homo sapiens (Human))
Merck Research Laboratories
Curated by ChEMBL
LigandPNGBDBM50018528(CHEMBL3290664)
Affinity DataIC50:  1.22E+3nM. Assay description: Inhibition of recombinant human AHCY using SAH as substrate assessed as formation of homocysteine after 10 mins
In DepthDetails ArticlePubMed