BDBM50018569 3,3,14,14-Tetramethyl-hexadecanedioic acid::CHEMBL63829
SMILES CC(C)(CCCCCCCCCCC(C)(C)CC(O)=O)CC(O)=O
InChI Key InChIKey=HYSMCRNFENOHJH-UHFFFAOYSA-N
Data  4 KI
  Tab Delimited (TSV)   2D SDfile   Computed 3D by Vconf -m prep SDfile
Find this compound or compounds like it in BindingDB:
Activity Spreadsheet -- Enzyme Inhibition Constant Data from BindingDB
Found 4 hits for monomerid = 50018569
TargetATP-citrate synthase(Rattus norvegicus)
Wayne State University
Curated by ChEMBL
LigandPNGBDBM50018569(3,3,14,14-Tetramethyl-hexadecanedioic acid | CHEMB...)
Affinity DataKi:  3.00E+3nM. Assay description: Competitive inhibition of rat liver ACLY using CoA as substrate by spectrophotometric analysis
In DepthDetails ArticlePubMed
TargetATP-citrate synthase(Rattus norvegicus)
Wayne State University
Curated by ChEMBL
LigandPNGBDBM50018569(3,3,14,14-Tetramethyl-hexadecanedioic acid | CHEMB...)
Affinity DataKi:  1.60E+4nM. Assay description: Inhibition of rat liver ACLY
In DepthDetails ArticlePubMed
TargetATP-citrate synthase(Rattus norvegicus)
Wayne State University
Curated by ChEMBL
LigandPNGBDBM50018569(3,3,14,14-Tetramethyl-hexadecanedioic acid | CHEMB...)
Affinity DataKi:  1.60E+4nM. Assay description: Competitive inhibition of rat liver ACLY using citrate as substrate by spectrophotometric analysis
In DepthDetails ArticlePubMed
TargetATP-citrate synthase(Rattus norvegicus)
Wayne State University
Curated by ChEMBL
LigandPNGBDBM50018569(3,3,14,14-Tetramethyl-hexadecanedioic acid | CHEMB...)
Affinity DataKi:  1.60E+7nM. Assay description: Inhibition against ATP-citrate lyase in liver.
In DepthDetails ArticlePubMed