BDBM50019010 CHEMBL3288082
SMILES [Na+].[Na+].[H][C@]12[C@@H](CC[C@]1(C)[C@H](C[C@]1(C)[C@]2([H])CC[C@]2([H])[C@@]3(C)CC[C@H](OS([O-])(=O)=O)C(C)(C)[C@]3([H])CC[C@@]12C)OS([O-])(=O)=O)C(C)C
InChI Key InChIKey=XVDRHYGNDFAGFN-CTNMRGLWSA-L
Data  1 KI  2 IC50
  Tab Delimited (TSV)   2D SDfile   Computed 3D by Vconf -m prep SDfile
Find this compound or compounds like it in BindingDB:
Activity Spreadsheet -- Enzyme Inhibition Constant Data from BindingDB
Found 3 hits for monomerid = 50019010
TargetAcetylcholinesterase(Tetronarce californica (Pacific electric ray) (Tor...)
Universidad Nacional Del Sur
Curated by ChEMBL
LigandPNGBDBM50019010(CHEMBL3288082)
Affinity DataKi:  1.44E+5nM. Assay description: Uncompetitive inhibition of Pacific electric ray AChE using acetylthiocholine as substrate by Lineweaver-Burk plot analysis
In DepthDetails ArticlePubMed
TargetAcetylcholinesterase(Tetronarce californica (Pacific electric ray) (Tor...)
Universidad Nacional Del Sur
Curated by ChEMBL
LigandPNGBDBM50019010(CHEMBL3288082)
Affinity DataIC50:  5.88E+4nM. Assay description: Inhibition of Pacific electric ray AChE using acetylthiocholine iodide as substrate after 60 mins by Ellman's method
In DepthDetails ArticlePubMed
TargetCholinesterase(Equus caballus (Horse))
Universidad Nacional Del Sur
Curated by ChEMBL
LigandPNGBDBM50019010(CHEMBL3288082)
Affinity DataIC50:  1.04E+5nM. Assay description: Inhibition of BChE in horse serum using butyrylthiocholine iodide as substrate after 120 mins by Ellman's method
In DepthDetails ArticlePubMed