BDBM50021539 2-(3-Mercapto-propionyl)-2,3-dihydro-1H-isoindole-1-carboxylic acid::CHEMBL417226
SMILES OC(=O)C1N(Cc2ccccc12)C(=O)CCS
InChI Key InChIKey=ZHNQDNJEWOPPRT-UHFFFAOYSA-N
Data  1 IC50
  Tab Delimited (TSV)   2D SDfile   Computed 3D by Vconf -m prep SDfile
Find this compound or compounds like it in BindingDB:
Activity Spreadsheet -- Enzyme Inhibition Constant Data from BindingDB
Found 1 hit for monomerid = 50021539
TargetAngiotensin-converting enzyme(Homo sapiens (Human))
TBA
Curated by ChEMBL
LigandPNGBDBM50021539(2-(3-Mercapto-propionyl)-2,3-dihydro-1H-isoindole-...)
Affinity DataIC50:  5.80E+4nM. Assay description: Inhibition of guinea pig angiotensin I converting enzyme
In DepthDetails ArticlePubMed